chyba pri inštalovaní

Sekcia: Aplikácie & Desktop 06.10 | 19:02
Avatar caopyp   Používateľ

Ahojte taká vec sa mi stala, inštalujem labplotlabplot

A cez superMake to compilujem a vždy keď mu ešte dajaký balík chyba tak ho doinštalujem

Už sa to rozbehlo a začalo inštalovať a potom vyskočila hlaška:

Stiahnuté/labplot-2.7.0/src/backend/worksheet/TextLabel.cpp:46:10: fatal error: QtConcurrentRun: No such file or directory
 #include <QtConcurrentRun>
          ^~~~~~~~~~~~~~~~~
compilation terminated.
src/CMakeFiles/labplot2lib.dir/build.make:3573: recipe for target 'src/CMakeFiles/labplot2lib.dir/backend/worksheet/TextLabel.cpp.o' failed
make[2]: *** [src/CMakeFiles/labplot2lib.dir/backend/worksheet/TextLabel.cpp.o] Error 1
make[2]: *** Waiting for unfinished jobs....
-- building... ja/labplot2.po to labplot2.mo
-- building... lt/labplot2.po to labplot2.mo
-- building... nds/labplot2.po to labplot2.mo
-- building... nl/labplot2.po to labplot2.mo
-- building... pl/labplot2.po to labplot2.mo
-- building... pt/labplot2.po to labplot2.mo
-- building... pt_BR/labplot2.po to labplot2.mo
-- building... ru/labplot2.po to labplot2.mo
-- building... sk/labplot2.po to labplot2.mo
-- building... sv/labplot2.po to labplot2.mo
-- building... tr/labplot2.po to labplot2.mo
-- building... uk/labplot2.po to labplot2.mo
-- building... zh_CN/labplot2.po to labplot2.mo
-- building... zh_TW/labplot2.po to labplot2.mo
[  5%] Built target pofiles-6c0ab366f7faa39e09e2ff3e6f1925e4
CMakeFiles/Makefile2:715: recipe for target 'src/CMakeFiles/labplot2lib.dir/all' failed
make[1]: *** [src/CMakeFiles/labplot2lib.dir/all] Error 2
Makefile:140: recipe for target 'all' failed
make: *** [all] Error 2
</p>
<p></p>
A neviem čo ďalej pretože som našiel balík libqt5concurrent5 a je nainštalovaný, netuším čo viac mam urobiť. Ešte mam linux mint 19.1, 64bit.
Vieš aký je rozdiel medzi konšpiračnou teóriou a realitou? Asi 2 roky
    • RE: chyba pri inštalovaní 06.10 | 19:32
      Avatar bedňa LegacyIce-antiX  Administrátor

      Buď by som použil snap, alebo zdrojáky ťahal priamo zo stránok projektu a postupoval podľa inštrukcií, čo sú tam.

      Táto správa neobsahuje vírus, pretože nepoužívam MS Windows. http://kernelultras.org
    • RE: chyba pri inštalovaní 06.10 | 21:26
      Avatar redhawk75 mx19, galliumos, antiX, Devuan,  Používateľ

      nepises OS ale kedze davas ubuntu, bud ako pise bedna pouzi snap alebo si stiahni deb balicek a nainstaluj cez debi

      popripade najnovsi build 2,8 maju na PPA (experimental)  a podla verzie Ubuntu si pridaj PPA a potom uz len nainstaluj

       

    • RE: chyba pri inštalovaní 06.10 | 22:32
      Avatar caopyp   Používateľ

      Takže už píše inu chybu, dajaký adresár mu chýba (touto cestou som už nešiel) .. skusil som to nainštalovať cez deb

      Dependency is not satisfiable

      a potom som pridal app

      sudo add-apt-repository ppa:rikmills/experimental
      sudo apt-get update

      c

      Toto už ide ďakujem za pomoc

      Vieš aký je rozdiel medzi konšpiračnou teóriou a realitou? Asi 2 roky
    • RE: chyba pri inštalovaní 06.10 | 22:44
      Avatar Pavel KDE neon  Administrátor

      Tak ako bolo spomenuté vyššie, najjednoduchšie je použiť snap pri inštalácii,,,

      Desktop: KDE | IM: Franz | Web: Vivaldi
      • RE: chyba pri inštalovaní 07.10 | 07:49
        Avatar redhawk75 mx19, galliumos, antiX, Devuan,  Používateľ

        Presne tak, aj ked na snap maju starsi balicek.

        • RE: chyba pri inštalovaní 07.10 | 17:01
          Avatar app   Návštevník

          Ale on si pridal

          a potom som pridal app

          co bolo v konecnom stave ppa

          Tomu sa hovori dvojita dislexia

          :D

          • RE: chyba pri inštalovaní 08.10 | 12:11
            Avatar Pavel KDE neon  Administrátor

            Mal som dlhšie otvorený komentár a kým som pridal koment chlap to už doriešil.

            Desktop: KDE | IM: Franz | Web: Vivaldi